rpm creation problems

Gavin Jones roggtemp at yahoo.co.uk
Fri May 30 01:46:54 CEST 2003

Hi all,

Had the following problems building rpms on redhat 9 with full updates, latest cvs checkout 23:00 29th May.

error: Failed build dependencies:
	gthread-devel >= 2.0.0 is needed by xfprint-0.0.2-1
make: *** [rpm] Error 1

rpmfind can't find 1 entry for this package.


config.status: creating xfce4-about/INFO.html.ca
config.status: error: cannot find input file: xfce4-about/INFO.html.ca.in

make[1]: Leaving directory `/usr/src/xfce4/xfce-devel/xffm'
make: *** No rule to make target `acconfig.h', needed by `distdir'.  Stop.

make[5]: Entering directory `/usr/src/redhat/BUILD/xfwm4-0.90/doc/C/images'
make[5]: *** No rule to make target `decoration_style.png', needed by `all-am'.  Stop.
make[5]: Leaving directory `/usr/src/redhat/BUILD/xfwm4-0.90/doc/C/images'
make[4]: *** [all-recursive] Error 1
make[4]: Leaving directory `/usr/src/redhat/BUILD/xfwm4-0.90/doc/C'
make[3]: *** [all-recursive] Error 1
make[3]: Leaving directory `/usr/src/redhat/BUILD/xfwm4-0.90/doc'
make[2]: *** [all-recursive] Error 1
make[2]: Leaving directory `/usr/src/redhat/BUILD/xfwm4-0.90'
make[1]: *** [all] Error 2
make[1]: Leaving directory `/usr/src/redhat/BUILD/xfwm4-0.90'
error: Bad exit status from /var/tmp/rpm-tmp.36569 (%build)

I haven't tried the extras yet. Anyone got any ideas ?


More information about the Xfce4-dev mailing list