[Thunar-dev] Build Failure

Benedikt Meurer benedikt.meurer at unix-ag.uni-siegen.de
Tue Apr 11 10:02:45 CEST 2006

Biju Chacko wrote:
> Hi,

Hey botsie,

> In svn head, thunar fails to build -- with the following error:
> thunar-details-view.c: In function ‘thunar_details_view_connect_ui_manager’:
> thunar-details-view.c:431: error: ‘thunar_details_view_ui’ undeclared 
> (first use in this function)
> thunar-details-view.c:431: error: (Each undeclared identifier is 
> reported only once
> thunar-details-view.c:431: error: for each function it appears in.)
> thunar-details-view.c:432: error: ‘thunar_details_view_ui_length’ 
> undeclared (first use in this function)
> I'm building on FC5 x86_64.

Run 'make distclean' and remember to enable maintainer mode.

> -- b


More information about the Thunar-dev mailing list